Target
3-oxo-5-alpha-steroid 4-dehydrogenase 2
Ligand
BDBM50057498
Substrate
Meas. Tech.
ChEMBL_202900 (CHEMBL807652)
Ki
40±n/a nM
Citation
 Kenny, BBallard, SBlagg, JFox, D Pharmacological options in the treatment of benign prostatic hyperplasia. J Med Chem 40:1293-315 (1997)  
Target
Name:
3-oxo-5-alpha-steroid 4-dehydrogenase 2
Synonyms:
3-oxo-5-alpha-steroid 4-dehydrogenase 2 5α-Reductase 2 (5α-R2) SR type 2 Steroid 5-alpha-reductase Type II 5-alpha reductase
Type:
Enzyme
Mol. Mass.:
28406.59
Organism:
Homo sapiens (Human)
Description:
P31213
Residue:
254
  
Inhibitor
Name:
BDBM50057498
Synonyms:
5-Benzyloxy-1H-indole-2-carboxylic acid | CHEMBL24850
Type:
Small organic molecule
Emp. Form.:
C16H13NO3
Mol. Mass.:
267.2793
SMILES:
OC(=O)c1cc2cc(OCc3ccccc3)ccc2[nH]1
: