Target
3-oxo-5-alpha-steroid 4-dehydrogenase 1
Ligand
BDBM50044889
Substrate
Meas. Tech.
ChEMBL_205217 (CHEMBL816491)
IC50
6500±n/a nM
Citation
 Kenny, BBallard, SBlagg, JFox, D Pharmacological options in the treatment of benign prostatic hyperplasia. J Med Chem 40:1293-315 (1997)  
Target
Name:
3-oxo-5-alpha-steroid 4-dehydrogenase 1
Synonyms:
3-oxo-5-alpha-steroid 4-dehydrogenase 1 S5A1_HUMAN SR type 1 Steroid 5-alpha-reductase | Steroid 5-alpha-reductase 1
Type:
Enzyme
Mol. Mass.:
29472.80
Organism:
Homo sapiens (Human)
Description:
P18405
Residue:
259
  
Inhibitor
Name:
BDBM50044889
Synonyms:
1,4,5,6-Tetrahydro-2H-benzo[f]quinolin-3-one | CHEMBL27549
Type:
Small organic molecule
Emp. Form.:
C13H13NO
Mol. Mass.:
199.2484
SMILES:
O=C1CCC2=C(CCc3ccccc23)N1
: