Target
Sodium-dependent dopamine transporter
Ligand
BDBM50454897
Substrate
Meas. Tech.
ChEMBL_62324 (CHEMBL674263)
Ki
17±n/a nM
Citation
 Emond, PGarreau, LChalon, SBoazi, MCaillet, MBricard, JFrangin, YMauclaire, LBesnard, JCGuilloteau, D Synthesis and ligand binding of nortropane derivatives: N-substituted 2beta-carbomethoxy-3beta-(4'-iodophenyl)nortropane and N-(3-iodoprop-(2E)-enyl)-2beta-carbomethoxy-3beta-(3',4'-disubstituted phenyl)nortropane. New high-affinity and selective compounds for the dopamine transporter. J Med Chem 40:1366-72 (1997)  
Target
Name:
Sodium-dependent dopamine transporter
Synonyms:
DA transporter SC6A3_RAT Sodium-dependent dopamine transporter | Sodium-dependent dopamine transporter (DAT)
Type:
Multi-pass membrane protein
Mol. Mass.:
68749.45
Organism:
Rattus norvegicus (rat)
Description:
P23977
Residue:
619
  
Inhibitor
Name:
BDBM50454897
Synonyms:
CHEMBL2113648
Type:
Small organic molecule
Emp. Form.:
C19H24INO2
Mol. Mass.:
425.3038
SMILES:
COC(=O)[C@@H]1C2CCC(C[C@@H]1c1ccc(C)cc1)N2C\C=C\I
: