Target
Calpain-1 catalytic subunit
Ligand
BDBM50014577
Substrate
Meas. Tech.
ChEMBL_43866 (CHEMBL658526)
IC50
300±n/a nM
Citation
 Chatterjee, SGu, ZQDunn, DTao, MJosef, KTripathy, RBihovsky, RSenadhi, SEO'Kane, TMMcKenna, BAMallya, SAtor, MABozyczko-Coyne, DSiman, RMallamo, JP D-amino acid containing, high-affinity inhibitors of recombinant human calpain I. J Med Chem 41:2663-6 (1998)  
Target
Name:
Calpain-1 catalytic subunit
Synonyms:
CAN1_HUMAN CAPN1 Calpain-1 (u-Calpain) Calpain1
Type:
Protein
Mol. Mass.:
81880.51
Organism:
Homo sapiens (Human)
Description:
Residue:
714
  
Inhibitor
Name:
BDBM50014577
Synonyms:
CHEMBL286722 Z-Val-Phe-H [1-(1-Formyl-2-phenyl-ethylcarbamoyl)-2-methyl-propyl]-carbamic acid benzyl ester | benzyl (S)-3-methyl-1-oxo-1-((S)-1-oxo-3-phenylpropan-2-ylamino)butan-2-ylcarbamate
Type:
Small organic molecule
Emp. Form.:
C22H26N2O4
Mol. Mass.:
382.4528
SMILES:
CC(C)[C@H](NC(=O)OCc1ccccc1)C(=O)N[C@@H](Cc1ccccc1)C=O
: