Target
Nitric oxide synthase, endothelial
Ligand
BDBM50065833
Substrate
Meas. Tech.
ChEMBL_65318 (CHEMBL678091)
Ki
6200±n/a nM
Citation
 Collins, JLShearer, BGOplinger, JALee, SGarvey, EPSalter, MDuffy, CBurnette, TCFurfine, ES N-Phenylamidines as selective inhibitors of human neuronal nitric oxide synthase: structure-activity studies and demonstration of in vivo activity. J Med Chem 41:2858-71 (1998)  
Target
Name:
Nitric oxide synthase, endothelial
Synonyms:
Constitutive NOS Endothelial NOS NOS type III NOS3_HUMAN Nitric oxide synthase (inducible and endothelial) Nitric-oxide synthase (endothelial and brain) eNOS
Type:
Enzyme Catalytic Domain
Mol. Mass.:
133297.84
Organism:
Homo sapiens (Human)
Description:
P29474
Residue:
1203
  
Inhibitor
Name:
BDBM50065833
Synonyms:
CHEMBL542432 | N-(4-Aminomethyl-phenyl)-acetamidine
Type:
Small organic molecule
Emp. Form.:
C9H13N3
Mol. Mass.:
163.2196
SMILES:
CC(N)=Nc1ccc(CN)cc1
: