Target
Sodium channel protein type 2 subunit alpha
Ligand
BDBM50344821
Substrate
Meas. Tech.
ChEMBL_202576 (CHEMBL806327)
IC50
4±n/a nM
Citation
 Maillard, MCPerlman, MEAmitay, OBaxter, DBerlove, DConnaughton, SFischer, JBGuo, JQHu, LYMcBurney, RNNagy, PISubbarao, KYost, EAZhang, LDurant, GJ Design, synthesis, and pharmacological evaluation of conformationally constrained analogues of N,N'-diaryl- and N-aryl-N-aralkylguanidines as potent inhibitors of neuronal Na+ channels. J Med Chem 41:3048-61 (1998)  
Target
Name:
Sodium channel protein type 2 subunit alpha
Synonyms:
SCN2A_RAT Scn2a1 Sodium channel protein type 2 subunit alpha Sodium channel protein type II subunit alpha Voltage-gated sodium channel | Voltage-gated sodium channel subunit alpha Nav1.2
Type:
PROTEIN
Mol. Mass.:
227854.11
Organism:
Rattus norvegicus
Description:
ChEMBL_1516893
Residue:
2005
  
Inhibitor
Name:
BDBM50344821
Synonyms:
10-hydroxymethyl-5-imino-(2S)-12,13-dioxa-4,6-diazatetracyclo[7.3.1.13,11.03,8]tetradecane-1,2,7,10,14-pentaol CHEMBL507974 | tetrodotoxin
Type:
Small organic molecule
Emp. Form.:
C11H17N3O8
Mol. Mass.:
319.268
SMILES:
NC1=N[C@H](O)[C@H]2[C@H]3O[C@]4(O)O[C@@H]([C@@H](O)[C@@]2(N1)[C@@H]4O)[C@]3(O)CO
: