Target
Dihydroorotate dehydrogenase (quinone), mitochondrial
Ligand
BDBM50066578
Substrate
Meas. Tech.
ChEMBL_52887 (CHEMBL665411)
IC50
>50000±n/a nM
Citation
 Papageorgiou, CAlbert, RFloersheim, PLemaire, MBitch, FWeber, HPAndersen, EHungerford, VSchreier, MH Pyrazole bioisosteres of leflunomide as B-cell immunosuppressants for xenotransplantation and chronic rejection: scope and limitations. J Med Chem 41:3530-8 (1998)  
Target
Name:
Dihydroorotate dehydrogenase (quinone), mitochondrial
Synonyms:
DHODH Dihydroorotate dehydrogenase Dihydroorotate dehydrogenase, mitochondrial Dihydroorotate oxidase (DHODH) | PYRD_HUMAN
Type:
Enzyme
Mol. Mass.:
42881.33
Organism:
Homo sapiens (Human)
Description:
Q02127
Residue:
395
  
Inhibitor
Name:
BDBM50066578
Synonyms:
5-Pyridin-4-yl-3-(4-trifluoromethyl-phenylamino)-1H-pyrazole-4-carbonitrile | CHEMBL118645
Type:
Small organic molecule
Emp. Form.:
C16H10F3N5
Mol. Mass.:
329.2793
SMILES:
FC(F)(F)c1ccc(Nc2[nH]nc(c2C#N)-c2ccncc2)cc1
: