Target
P2Y purinoceptor 1
Ligand
BDBM50062279
Substrate
Meas. Tech.
ChEMBL_162504 (CHEMBL767332)
IC50
4190±n/a nM
Citation
 Camaioni, EBoyer, JLMohanram, AHarden, TKJacobson, KA Deoxyadenosine bisphosphate derivatives as potent antagonists at P2Y1 receptors. J Med Chem 41:183-90 (1998)  
Target
Name:
P2Y purinoceptor 1
Synonyms:
P2RY1 | P2RY1_MELGA
Type:
Mol. Mass.:
41199.64
Organism:
Meleagris gallopavo
Description:
Residue:
362
  
Inhibitor
Name:
BDBM50062279
Synonyms:
CHEMBL416789 US11185100, TABLE 7.1
Type:
Small organic molecule
Emp. Form.:
C10H15N5O10P2
Mol. Mass.:
427.2011
SMILES:
Nc1ncnc2n(cnc12)C1OC(COP(O)(O)=O)C(OP(O)(O)=O)C1O
: