Target
P2Y purinoceptor 1
Ligand
BDBM50062287
Substrate
Meas. Tech.
ChEMBL_162501 (CHEMBL767302)
EC50
6260±n/a nM
Citation
 Camaioni, EBoyer, JLMohanram, AHarden, TKJacobson, KA Deoxyadenosine bisphosphate derivatives as potent antagonists at P2Y1 receptors. J Med Chem 41:183-90 (1998)  
Target
Name:
P2Y purinoceptor 1
Synonyms:
P2RY1 | P2RY1_MELGA
Type:
Mol. Mass.:
41199.64
Organism:
Meleagris gallopavo
Description:
Residue:
362
  
Inhibitor
Name:
BDBM50062287
Synonyms:
CHEMBL298487 | Phosphoric acid mono-[5-(6-amino-purin-9-yl)-2-phosphonooxymethyl-tetrahydro-furan-3-yl] ester
Type:
Small organic molecule
Emp. Form.:
C10H15N5O9P2
Mol. Mass.:
411.2017
SMILES:
Nc1ncnc2n(cnc12)C1CC(OP(O)(O)=O)C(COP(O)(O)=O)O1
: