Target
Beta-lactamase
Ligand
BDBM50067069
Substrate
Meas. Tech.
ChEMBL_40259 (CHEMBL656489)
IC50
12±n/a nM
Citation
 Hubschwerlen, CAngehrn, PGubernator, KPage, MGSpecklin, JL Structure-based design of beta-lactamase inhibitors. 2. Synthesis and evaluation of bridged sulfactams and oxamazins. J Med Chem 41:3972-5 (1998)  
Target
Name:
Beta-lactamase
Synonyms:
AMPC_ENTCL | ampC
Type:
PROTEIN
Mol. Mass.:
41306.67
Organism:
Enterobacter cloacae
Description:
ChEMBL_40258
Residue:
381
  
Inhibitor
Name:
BDBM50067069
Synonyms:
CHEMBL128220 | sodium salt-Sulfuric acid mono-[2-(4-carbamoyl-phenylcarbamoyl)-7-oxo-2,6-diaza-bicyclo[3.2.0]hept-6-yl] ester
Type:
Small organic molecule
Emp. Form.:
C13H13N4O7S
Mol. Mass.:
369.33
SMILES:
NC(=O)c1ccc(NC(=O)N2CCC3C2C(=O)N3OS([O-])(=O)=O)cc1
: