Target
B2 bradykinin receptor
Ligand
BDBM50067319
Substrate
Meas. Tech.
ChEMBL_40265 (CHEMBL656501)
IC50
94±n/a nM
Citation
 Abe, YKayakiri, HSatoh, SInoue, TSawada, YInamura, NAsano, MAramori, IHatori, CSawai, HOku, TTanaka, H A novel class of orally active non-peptide bradykinin B2 receptor antagonists. 3. Discovering bioisosteres of the imidazo[1,2-a] pyridine moiety. J Med Chem 41:4062-79 (1998)  
Target
Name:
B2 bradykinin receptor
Synonyms:
B2 bradykinin receptor BDKRB2 BKRB2_CAVPO | Bradykinin B2 receptor
Type:
Mol. Mass.:
42217.03
Organism:
Cavia porcellus
Description:
Residue:
372
  
Inhibitor
Name:
BDBM50067319
Synonyms:
4-{(E)-2-[({[2,4-Dimethyl-3-(1-methyl-2-methylamino-1H-benzoimidazol-4-yloxymethyl)-phenyl]-methyl-carbamoyl}-methyl)-carbamoyl]-vinyl}-N-methyl-benzamide | CHEMBL288079
Type:
Small organic molecule
Emp. Form.:
C32H36N6O4
Mol. Mass.:
568.666
SMILES:
CNC(=O)c1ccc(\C=C\C(=O)NCC(=O)N(C)c2ccc(C)c(COc3cccc4n(C)c(NC)nc34)c2C)cc1
: