Target
B2 bradykinin receptor
Ligand
BDBM50067320
Substrate
Meas. Tech.
ChEMBL_40265 (CHEMBL656501)
IC50
2.2±n/a nM
Citation
 Abe, YKayakiri, HSatoh, SInoue, TSawada, YInamura, NAsano, MAramori, IHatori, CSawai, HOku, TTanaka, H A novel class of orally active non-peptide bradykinin B2 receptor antagonists. 3. Discovering bioisosteres of the imidazo[1,2-a] pyridine moiety. J Med Chem 41:4062-79 (1998)  
Target
Name:
B2 bradykinin receptor
Synonyms:
B2 bradykinin receptor BDKRB2 BKRB2_CAVPO | Bradykinin B2 receptor
Type:
Mol. Mass.:
42217.03
Organism:
Cavia porcellus
Description:
Residue:
372
  
Inhibitor
Name:
BDBM50067320
Synonyms:
5-{2-[({[2,4-Dimethyl-3-(2-methyl-quinolin-8-yloxymethyl)-phenyl]-methyl-carbamoyl}-methyl)-carbamoyl]-vinyl}-pyridine-2-carboxylic acid methylamide; dihydrochloride | CHEMBL541590
Type:
Small organic molecule
Emp. Form.:
C32H33N5O4
Mol. Mass.:
551.6355
SMILES:
CNC(=O)c1ccc(\C=C\C(=O)NCC(=O)N(C)c2ccc(C)c(COc3cccc4ccc(C)nc34)c2C)cn1
: