Target
B2 bradykinin receptor
Ligand
BDBM50067267
Substrate
Meas. Tech.
ChEMBL_40265 (CHEMBL656501)
IC50
510±n/a nM
Citation
 Abe, YKayakiri, HSatoh, SInoue, TSawada, YInamura, NAsano, MAramori, IHatori, CSawai, HOku, TTanaka, H A novel class of orally active non-peptide bradykinin B2 receptor antagonists. 3. Discovering bioisosteres of the imidazo[1,2-a] pyridine moiety. J Med Chem 41:4062-79 (1998)  
Target
Name:
B2 bradykinin receptor
Synonyms:
B2 bradykinin receptor BDKRB2 BKRB2_CAVPO | Bradykinin B2 receptor
Type:
Mol. Mass.:
42217.03
Organism:
Cavia porcellus
Description:
Residue:
372
  
Inhibitor
Name:
BDBM50067267
Synonyms:
4-{(E)-2-[({[2,4-Dichloro-3-(1-methyl-2-phenyl-1H-benzoimidazol-4-yloxymethyl)-phenyl]-methyl-carbamoyl}-methyl)-carbamoyl]-vinyl}-N-methyl-benzamide | CHEMBL264259
Type:
Small organic molecule
Emp. Form.:
C35H31Cl2N5O4
Mol. Mass.:
656.558
SMILES:
CNC(=O)c1ccc(\C=C\C(=O)NCC(=O)N(C)c2ccc(Cl)c(COc3cccc4n(C)c(nc34)-c3ccccc3)c2Cl)cc1
: