Target
B2 bradykinin receptor
Ligand
BDBM50067289
Substrate
Meas. Tech.
ChEMBL_40265 (CHEMBL656501)
IC50
0.650000±n/a nM
Citation
 Abe, YKayakiri, HSatoh, SInoue, TSawada, YInamura, NAsano, MAramori, IHatori, CSawai, HOku, TTanaka, H A novel class of orally active non-peptide bradykinin B2 receptor antagonists. 3. Discovering bioisosteres of the imidazo[1,2-a] pyridine moiety. J Med Chem 41:4062-79 (1998)  
Target
Name:
B2 bradykinin receptor
Synonyms:
B2 bradykinin receptor BDKRB2 BKRB2_CAVPO | Bradykinin B2 receptor
Type:
Mol. Mass.:
42217.03
Organism:
Cavia porcellus
Description:
Residue:
372
  
Inhibitor
Name:
BDBM50067289
Synonyms:
(E)-3-(6-Acetylamino-pyridin-3-yl)-N-({[2,4-dichloro-3-(2-methoxy-1-methyl-1H-benzoimidazol-4-yloxymethyl)-phenyl]-methyl-carbamoyl}-methyl)-acrylamide | CHEMBL264751
Type:
Small organic molecule
Emp. Form.:
C29H28Cl2N6O5
Mol. Mass.:
611.476
SMILES:
COc1nc2c(OCc3c(Cl)ccc(N(C)C(=O)CNC(=O)\C=C\c4ccc(NC(C)=O)nc4)c3Cl)cccc2n1C
: