Target
B2 bradykinin receptor
Ligand
BDBM50067318
Substrate
Meas. Tech.
ChEMBL_40265 (CHEMBL656501)
IC50
0.83±n/a nM
Citation
 Abe, YKayakiri, HSatoh, SInoue, TSawada, YInamura, NAsano, MAramori, IHatori, CSawai, HOku, TTanaka, H A novel class of orally active non-peptide bradykinin B2 receptor antagonists. 3. Discovering bioisosteres of the imidazo[1,2-a] pyridine moiety. J Med Chem 41:4062-79 (1998)  
Target
Name:
B2 bradykinin receptor
Synonyms:
B2 BRADYKININ B2R BK-2 receptor BKRB2_HUMAN | Bradykinin B2 receptor
Type:
Enzyme Catalytic Domain
Mol. Mass.:
44467.17
Organism:
Homo sapiens (Human)
Description:
B2 BRADYKININ BDKRB2 HUMAN::P30411
Residue:
391
  
Inhibitor
Name:
BDBM50067318
Synonyms:
4-{(E)-2-[({[2,4-Dichloro-3-(2-methoxy-1-methyl-1H-benzoimidazol-4-yloxymethyl)-phenyl]-methyl-carbamoyl}-methyl)-carbamoyl]-vinyl}-N-methyl-benzamide | CHEMBL44557
Type:
Small organic molecule
Emp. Form.:
C30H29Cl2N5O5
Mol. Mass.:
610.488
SMILES:
CNC(=O)c1ccc(\C=C\C(=O)NCC(=O)N(C)c2ccc(Cl)c(COc3cccc4n(C)c(OC)nc34)c2Cl)cc1
: