Target
E-selectin
Ligand
BDBM50067550
Substrate
Meas. Tech.
ChEMBL_199851 (CHEMBL804753)
IC50
>500000±n/a nM
Citation
 Tsukida, TMoriyama, HKurokawa, KAchiha, TInoue, YKondo, H Studies on selectin blockers. 7. Structure-activity relationships of sialyl Lewis X mimetics based on modified Ser-Glu dipeptides. J Med Chem 41:4279-87 (1998)  
Target
Name:
E-selectin
Synonyms:
ELAM1 SELE Selectin E
Type:
PROTEIN
Mol. Mass.:
66642.96
Organism:
Homo sapiens (Human)
Description:
ChEMBL_1438995
Residue:
610
  
Inhibitor
Name:
BDBM50067550
Synonyms:
4-[(R)-2-Hexadecanoylamino-3-(3,4,5-trihydroxy-6-methyl-tetrahydro-pyran-2-yloxy)-propionylamino]-4-methylcarbamoyl-butyric acid | CHEMBL135336
Type:
Small organic molecule
Emp. Form.:
C31H57N3O10
Mol. Mass.:
631.7984
SMILES:
CCCCCCCCCCCCCCCC(=O)N[C@H](COC1OC(C)C(O)C(O)C1O)C(=O)NC(CCC(O)=O)C(=O)NC
: