Target
P-selectin
Ligand
BDBM50060514
Substrate
Meas. Tech.
ChEMBL_200031 (CHEMBL873252)
IC50
300±n/a nM
Citation
 Tsukida, TMoriyama, HKurokawa, KAchiha, TInoue, YKondo, H Studies on selectin blockers. 7. Structure-activity relationships of sialyl Lewis X mimetics based on modified Ser-Glu dipeptides. J Med Chem 41:4279-87 (1998)  
Target
Name:
P-selectin
Synonyms:
GMRP LYAM3_HUMAN P-selectin/P-selectin glycoprotein ligand 1 | SELP
Type:
PROTEIN
Mol. Mass.:
90834.61
Organism:
Homo sapiens (Human)
Description:
ChEMBL_1438999
Residue:
830
  
Inhibitor
Name:
BDBM50060514
Synonyms:
(S)-4-Methylcarbamoyl-4-[(R)-2-(2-tetradecyl-hexadecanoylamino)-3-(3,4,5-trihydroxy-6-methyl-tetrahydro-pyran-2-yloxy)-propionylamino]-butyric acid | CHEMBL119836
Type:
Small organic molecule
Emp. Form.:
C45H85N3O10
Mol. Mass.:
828.1705
SMILES:
CCCCCCCCCCCCCCC(CCCCCCCCCCCCCC)C(=O)N[C@H](COC1OC(C)C(O)C(O)C1O)C(=O)N[C@@H](CCC(O)=O)C(=O)NC
: