Target
L-selectin
Ligand
BDBM50060515
Substrate
Meas. Tech.
ChEMBL_200000 (CHEMBL810689)
IC50
1800±n/a nM
Citation
 Tsukida, TMoriyama, HKurokawa, KAchiha, TInoue, YKondo, H Studies on selectin blockers. 7. Structure-activity relationships of sialyl Lewis X mimetics based on modified Ser-Glu dipeptides. J Med Chem 41:4279-87 (1998)  
Target
Name:
L-selectin
Synonyms:
LNHR LYAM1_HUMAN SELL | Selectin
Type:
PROTEIN
Mol. Mass.:
42187.20
Organism:
Homo sapiens (Human)
Description:
ChEMBL_200000
Residue:
372
  
Inhibitor
Name:
BDBM50060515
Synonyms:
(S)-4-Methylcarbamoyl-4-[(S)-2-(2-tetradecyl-hexadecanoylamino)-3-(3,4,5-trihydroxy-6-methyl-tetrahydro-pyran-2-yloxy)-propionylamino]-butyric acid CHEMBL76801
Type:
Small organic molecule
Emp. Form.:
C45H85N3O10
Mol. Mass.:
828.1705
SMILES:
CCCCCCCCCCCCCCC(CCCCCCCCCCCCCC)C(=O)N[C@@H](COC1OC(C)C(O)C(O)C1O)C(=O)N[C@@H](CCC(O)=O)C(=O)NC
: