Target
E-selectin
Ligand
BDBM50408284
Substrate
Meas. Tech.
ChEMBL_199851 (CHEMBL804753)
IC50
280000±n/a nM
Citation
 Tsukida, TMoriyama, HKurokawa, KAchiha, TInoue, YKondo, H Studies on selectin blockers. 7. Structure-activity relationships of sialyl Lewis X mimetics based on modified Ser-Glu dipeptides. J Med Chem 41:4279-87 (1998)  
Target
Name:
E-selectin
Synonyms:
ELAM1 SELE Selectin E
Type:
PROTEIN
Mol. Mass.:
66642.96
Organism:
Homo sapiens (Human)
Description:
ChEMBL_1438995
Residue:
610
  
Inhibitor
Name:
BDBM50408284
Synonyms:
CHEMBL2029056
Type:
Small organic molecule
Emp. Form.:
C48H91O18S
Mol. Mass.:
988.291
SMILES:
CCCCCCCCCCCCCCC(CCCCCCCCCCCCCC)CO[C@@H]1O[C@H](CO)[C@@H](O[C@@H]2O[C@H](CO)[C@H](O)[C@H](OS([O-])(=O)=O)[C@H]2O)[C@H](O[C@@H]2O[C@@H](C)[C@@H](O)[C@@H](O)[C@@H]2O)[C@H]1O
: