Target
Protein farnesyltransferase subunit beta/geranylgeranyltransferase type-1 subunit alpha
Ligand
BDBM50067563
Substrate
Meas. Tech.
ChEMBL_70273 (CHEMBL681412)
IC50
0.40±n/a nM
Citation
 Augeri, DJO'Connor, SJJanowick, DSzczepankiewicz, BSullivan, GLarsen, JKalvin, DCohen, JDevine, EZhang, HCherian, SSaeed, BNg, SCRosenberg, S Potent and selective non-cysteine-containing inhibitors of protein farnesyltransferase. J Med Chem 41:4288-300 (1998)  
Target
Name:
Protein farnesyltransferase subunit beta/geranylgeranyltransferase type-1 subunit alpha
Synonyms:
Protein Farnesyltransferase (PFT) | Protein farnesyltransferase
Type:
Protein Complex
Mol. Mass.:
Description:
Purified bovine brain FTase.
Components:
This complex has 2 components.
Component 1
Name:
Protein farnesyltransferase/geranylgeranyltransferase type-1 subunit alpha
Synonyms:
CAAX farnesyltransferase alpha subunit FNTA_BOVIN GGTase-I-alpha Protein Farnesyltransferase (PFT) Chain A Protein farnesyltransferase/geranylgeranyltransferase type I alpha subunit Type I protein geranyl-geranyltransferase alpha subunit
Type:
Enzyme
Mol. Mass.:
43827.38
Organism:
Bos taurus (bovine)
Description:
The enzyme was purified from a bovine brain homogenate by sequential ammonium sulfate fractionation and affinity chromatography.
Residue:
375
  
Component 2
Name:
Protein farnesyltransferase subunit beta
Synonyms:
CAAX farnesyltransferase subunit beta FNTB_BOVIN Protein farnesyltransferase Protein farnesyltransferase subunit beta Ras proteins prenyltransferase subunit beta
Type:
Enzyme Subunit
Mol. Mass.:
48758.49
Organism:
Bos taurus (bovine)
Description:
Protein farnesyltransferase subunit beta
Residue:
437
  
Inhibitor
Name:
BDBM50067563
Synonyms:
(S)-2-{[2'-Methyl-5-(pyridin-3-yloxymethyl)-biphenyl-2-carbonyl]-amino}-4-methylsulfanyl-butyric acid CHEMBL274122
Type:
Small organic molecule
Emp. Form.:
C25H26N2O4S
Mol. Mass.:
450.55
SMILES:
CSCC[C@H](NC(=O)c1ccc(COc2cccnc2)cc1-c1ccccc1C)C(O)=O
: