Target
Cannabinoid receptor 1
Ligand
BDBM50067735
Substrate
Meas. Tech.
ChEMBL_46827 (CHEMBL658061)
Ki
0.77±n/a nM
Citation
 Singer, MRyan, WJSaha, BMartin, BRRazdan, RK Potent cyano and carboxamido side-chain analogues of 1', 1'-dimethyl-delta8-tetrahydrocannabinol. J Med Chem 41:4400-7 (1998)  
Target
Name:
Cannabinoid receptor 1
Synonyms:
CANN6 CB-R CNR CNR1_HUMAN Cannabinoid receptor Cannabinoid receptor 1 (brain)
Type:
G Protein-Coupled Receptor (GPCR)
Mol. Mass.:
52868.96
Organism:
Homo sapiens (Human)
Description:
P21554
Residue:
472
  
Inhibitor
Name:
BDBM50067735
Synonyms:
(6aR,10aR)-3-(1,1-Dimethyl-heptyl)-6,6,9-trimethyl-6a,7,10,10a-tetrahydro-6H-benzo[c]chromen-1-ol 3-(1,1-Dimethyl-heptyl)-6,6,9-trimethyl-6a,7,10,10a-tetrahydro-6H-benzo[c]chromen-1-ol | CHEMBL411626
Type:
Small organic molecule
Emp. Form.:
C25H38O2
Mol. Mass.:
370.568
SMILES:
CCCCCCC(C)(C)c1cc(O)c2[C@@H]3CC(C)=CC[C@H]3C(C)(C)Oc2c1
: