Target
B2 bradykinin receptor
Ligand
BDBM50067929
Substrate
Meas. Tech.
ChEMBL_40294 (CHEMBL884128)
IC50
0.41±n/a nM
Citation
 Abe, YKayakiri, HSatoh, SInoue, TSawada, YInamura, NAsano, MAramori, IHatori, CSawai, HOku, TTanaka, H A novel class of orally active non-peptide bradykinin B2 receptor antagonists. 4. Discovery of novel frameworks mimicking the active conformation. J Med Chem 41:4587-98 (1998)  
Target
Name:
B2 bradykinin receptor
Synonyms:
B2 BRADYKININ B2R BK-2 receptor BKRB2_HUMAN | Bradykinin B2 receptor
Type:
Enzyme Catalytic Domain
Mol. Mass.:
44467.17
Organism:
Homo sapiens (Human)
Description:
B2 BRADYKININ BDKRB2 HUMAN::P30411
Residue:
391
  
Inhibitor
Name:
BDBM50067929
Synonyms:
4-(2-{[(E)-3-(4-Dimethylcarbamoyl-phenyl)-acryloylamino]-methyl}-pyrrol-1-yl)-N*1*,N*1*,N*3*,N*3*-tetramethyl-2-(2-methyl-quinolin-8-yloxymethyl)-isophthalamide; hydrochloride | CHEMBL537683
Type:
Small organic molecule
Emp. Form.:
C40H42N6O5
Mol. Mass.:
686.7987
SMILES:
CN(C)C(=O)c1ccc(\C=C\C(=O)NCc2cccn2-c2ccc(C(=O)N(C)C)c(COc3cccc4ccc(C)nc34)c2C(=O)N(C)C)cc1
: