Target
D(2) dopamine receptor
Ligand
BDBM55121
Substrate
Meas. Tech.
ChEMBL_61319 (CHEMBL670094)
Ki
15±n/a nM
Citation
 Cervetto, LDemontis, GCGiannaccini, GLongoni, BMacchia, BMacchia, MMartinelli, AOrlandini, E N-n-Propyl-substituted 3-(dimethylphenyl)piperidines display novel discriminative properties between dopamine receptor subtypes: synthesis and receptor binding studies. J Med Chem 41:4933-8 (1999)  
Target
Name:
D(2) dopamine receptor
Synonyms:
DOPAMINE D2 DRD2_BOVIN | Dopamine D2 receptor
Type:
Enzyme Catalytic Domain
Mol. Mass.:
50698.79
Organism:
BOVINE
Description:
P20288
Residue:
444
  
Inhibitor
Name:
BDBM55121
Synonyms:
3-HYDROXYTYRAMINE HYDROCHLORIDE 4-(2-aminoethyl)pyrocatechol;hydrochloride Dopamine SMR000059081 | cid_65340
Type:
Small organic molecule
Emp. Form.:
C8H11NO2
Mol. Mass.:
153.1784
SMILES:
NCCc1ccc(O)c(O)c1
: