Target
Coagulation factor X
Ligand
BDBM50068490
Substrate
Meas. Tech.
ChEMBL_48833 (CHEMBL661806)
Ki
28±n/a nM
Citation
 Kucznierz, RGrams, FLeinert, HMarzenell, KEngh, RAvon der Saal, W Tetrahydro-isoquinoline-based factor Xa inhibitors. J Med Chem 41:4983-94 (1999)  
Target
Name:
Coagulation factor X
Synonyms:
Activated coagulation factor X (FXa) Coagulation factor X precursor F10 Factor X heavy chain Factor Xa Stuart-Prower factor
Type:
Enzyme
Mol. Mass.:
54726.60
Organism:
Homo sapiens (Human)
Description:
Residue:
488
  
Inhibitor
Name:
BDBM50068490
Synonyms:
CHEMBL146940 | [4-(1-Carbamimidoyl-piperidin-4-yloxy)-phenyl]-(2-carbamimidoyl-1,2,3,4-tetrahydro-isoquinolin-7-yloxy)-acetic acid ethyl ester
Type:
Small organic molecule
Emp. Form.:
C26H34N6O4
Mol. Mass.:
494.586
SMILES:
CCOC(=O)C(Oc1ccc2CCN(Cc2c1)C(N)=N)c1ccc(OC2CCN(CC2)C(N)=N)cc1
: