Target
Peptidyl-prolyl cis-trans isomerase FKBP1A
Ligand
BDBM50068549
Substrate
Meas. Tech.
ChEMBL_66273 (CHEMBL678143)
Ki
>10000±n/a nM
Citation
 Hamilton, GSSteiner, JP Immunophilins: beyond immunosuppression. J Med Chem 41:5119-43 (1999)  
Target
Name:
Peptidyl-prolyl cis-trans isomerase FKBP1A
Synonyms:
12 kDa FK506-binding protein FK506-binding protein 1A FKB1A_HUMAN FKBP-1A FKBP12 Immunophilin FKBP12 PPIase FKBP1A Rotamase mTOR/FKBP12A/FKBP12B
Type:
Isomerase
Mol. Mass.:
11953.09
Organism:
Homo sapiens (Human)
Description:
P62942
Residue:
108
  
Inhibitor
Name:
BDBM50068549
Synonyms:
1-(2-Oxo-propionyl)-piperidine-2-carboxylic acid ethyl ester | CHEMBL107603
Type:
Small organic molecule
Emp. Form.:
C11H17NO4
Mol. Mass.:
227.257
SMILES:
CCOC(=O)C1CCCCN1C(=O)C(C)=O
: