Target
Endothelin receptor type B
Ligand
BDBM50068706
Substrate
Meas. Tech.
ChEMBL_64185 (CHEMBL878144)
Ki
2300±n/a nM
Citation
 Murugesan, NGu, ZStein, PDBisaha, SSpergel, SGirotra, RLee, VGLloyd, JMisra, RNSchmidt, JMathur, AStratton, LKelly, YFBird, EWaldron, TLiu, ECZhang, RLee, HSerafino, RAbboa-Offei, BMathers, PGiancarli, MSeymour, AAWebb, MLHunt, JT Biphenylsulfonamide endothelin antagonists: structure-activity relationships of a series of mono- and disubstituted analogues and pharmacology of the orally active endothelin antagonist 2'-amino-N- (3,4-dimethyl-5-isoxazolyl)-4'-(2-methylpropyl)[1, 1'-biphenyl]-2-sulfonamide (BMS-187308). J Med Chem 41:5198-218 (1999)  
Target
Name:
Endothelin receptor type B
Synonyms:
EDNRB_RAT ET-B Endothelin receptor | Endothelin receptor non-selective type
Type:
Enzyme Catalytic Domain
Mol. Mass.:
49483.43
Organism:
RAT
Description:
ENDOTHELIN B EDNRB RAT::P21451
Residue:
442
  
Inhibitor
Name:
BDBM50068706
Synonyms:
6-(2-Hydroxy-ethoxy)-4'-isobutyl-biphenyl-2-sulfonic acid (3,4-dimethyl-isoxazol-5-yl)-amide | CHEMBL149819
Type:
Small organic molecule
Emp. Form.:
C23H28N2O5S
Mol. Mass.:
444.544
SMILES:
CC(C)Cc1ccc(cc1)-c1c(OCCO)cccc1S(=O)(=O)Nc1onc(C)c1C
: