Target
Endothelin receptor type B
Ligand
BDBM50068721
Substrate
Meas. Tech.
ChEMBL_64185 (CHEMBL878144)
Ki
9800±n/a nM
Citation
 Murugesan, NGu, ZStein, PDBisaha, SSpergel, SGirotra, RLee, VGLloyd, JMisra, RNSchmidt, JMathur, AStratton, LKelly, YFBird, EWaldron, TLiu, ECZhang, RLee, HSerafino, RAbboa-Offei, BMathers, PGiancarli, MSeymour, AAWebb, MLHunt, JT Biphenylsulfonamide endothelin antagonists: structure-activity relationships of a series of mono- and disubstituted analogues and pharmacology of the orally active endothelin antagonist 2'-amino-N- (3,4-dimethyl-5-isoxazolyl)-4'-(2-methylpropyl)[1, 1'-biphenyl]-2-sulfonamide (BMS-187308). J Med Chem 41:5198-218 (1999)  
Target
Name:
Endothelin receptor type B
Synonyms:
EDNRB_RAT ET-B Endothelin receptor | Endothelin receptor non-selective type
Type:
Enzyme Catalytic Domain
Mol. Mass.:
49483.43
Organism:
RAT
Description:
ENDOTHELIN B EDNRB RAT::P21451
Residue:
442
  
Inhibitor
Name:
BDBM50068721
Synonyms:
CHEMBL150269 | N-[6-(3,4-Dimethyl-isoxazol-5-ylsulfamoyl)-4'-isobutyl-biphenyl-3-yl]-acetamide
Type:
Small organic molecule
Emp. Form.:
C23H27N3O4S
Mol. Mass.:
441.543
SMILES:
CC(C)Cc1ccc(cc1)-c1cc(NC(C)=O)ccc1S(=O)(=O)Nc1onc(C)c1C
: