Target
Voltage-dependent L-type calcium channel subunit alpha-1D
Ligand
BDBM50072804
Substrate
Meas. Tech.
ChEMBL_44709 (CHEMBL656598)
Ki
220±n/a nM
Citation
 Di Stilo, AVisentin, SCena, CGasco, AMErmondi, GGasco, A New 1,4-dihydropyridines conjugated to furoxanyl moieties, endowed with both nitric oxide-like and calcium channel antagonist vasodilator activities. J Med Chem 41:5393-401 (1999)  
Target
Name:
Voltage-dependent L-type calcium channel subunit alpha-1D
Synonyms:
CAC1D_RAT Cacn4 Cacnl1a2 Cav1.3/Cav beta3/Cav alpha2delta complex RBD Voltage-dependent L-type calcium channel subunit alpha-1D Voltage-gated calcium channel subunit alpha Cav1.3
Type:
PROTEIN
Mol. Mass.:
250148.41
Organism:
Rattus norvegicus
Description:
ChEMBL_44709
Residue:
2203
  
Inhibitor
Name:
BDBM50072804
Synonyms:
4-[3-(4-Cyano-2-oxy-furazan-3-ylmethoxy)-phenyl]-2,6-dimethyl-1,4-dihydro-pyridine-3,5-dicarboxylic acid dimethyl ester | CHEMBL150802
Type:
Small organic molecule
Emp. Form.:
C21H20N4O7
Mol. Mass.:
440.4061
SMILES:
COC(=O)C1=C(C)[N-]C(C)=C(C1c1cccc(OCc2c(no[n+]2[O-])C#N)c1)C(=[OH+])OC
: