Target
Neuronal acetylcholine receptor subunit alpha-3
Ligand
BDBM50062641
Substrate
Meas. Tech.
ChEMBL_223075 (CHEMBL842924)
EC50
200±n/a nM
Citation
 Holladay, MWWasicak, JTLin, NHHe, YRyther, KBBannon, AWBuckley, MJKim, DJDecker, MWAnderson, DJCampbell, JEKuntzweiler, TADonnelly-Roberts, DLPiattoni-Kaplan, MBriggs, CAWilliams, MArneric, SP Identification and initial structure-activity relationships of (R)-5-(2-azetidinylmethoxy)-2-chloropyridine (ABT-594), a potent, orally active, non-opiate analgesic agent acting via neuronal nicotinic acetylcholine receptors. J Med Chem 41:407-12 (1998)  
Target
Name:
Neuronal acetylcholine receptor subunit alpha-3
Synonyms:
ACHA3_HUMAN Cholinergic, Nicotinic Alpha3Beta2 Cholinergic, Nicotinic Alpha3Beta4x NACHRA3 Neuronal acetylcholine receptor subunit alpha-3 nicotinic central
Type:
Enzyme Catalytic Domain
Mol. Mass.:
57479.03
Organism:
Homo sapiens (Human)
Description:
Cholinergic, Nicotinic Alpha3Beta2 0 HUMAN::P32297
Residue:
505
  
Inhibitor
Name:
BDBM50062641
Synonyms:
5-((R)-1-Azetidin-2-ylmethoxy)-2-chloro-pyridine TEBENICILINE | Tebanicline tosylate
Type:
Small organic molecule
Emp. Form.:
C9H11ClN2O
Mol. Mass.:
198.649
SMILES:
Clc1ccc(OC[C@H]2CCN2)cn1
: