Target
Neuronal acetylcholine receptor subunit alpha-3
Ligand
BDBM50062642
Substrate
Meas. Tech.
ChEMBL_223075 (CHEMBL842924)
EC50
500±n/a nM
Citation
 Holladay, MWWasicak, JTLin, NHHe, YRyther, KBBannon, AWBuckley, MJKim, DJDecker, MWAnderson, DJCampbell, JEKuntzweiler, TADonnelly-Roberts, DLPiattoni-Kaplan, MBriggs, CAWilliams, MArneric, SP Identification and initial structure-activity relationships of (R)-5-(2-azetidinylmethoxy)-2-chloropyridine (ABT-594), a potent, orally active, non-opiate analgesic agent acting via neuronal nicotinic acetylcholine receptors. J Med Chem 41:407-12 (1998)  
Target
Name:
Neuronal acetylcholine receptor subunit alpha-3
Synonyms:
ACHA3_HUMAN Cholinergic, Nicotinic Alpha3Beta2 Cholinergic, Nicotinic Alpha3Beta4x NACHRA3 Neuronal acetylcholine receptor subunit alpha-3 nicotinic central
Type:
Enzyme Catalytic Domain
Mol. Mass.:
57479.03
Organism:
Homo sapiens (Human)
Description:
Cholinergic, Nicotinic Alpha3Beta2 0 HUMAN::P32297
Residue:
505
  
Inhibitor
Name:
BDBM50062642
Synonyms:
2-Chloro-5-((R)-1-pyrrolidin-2-ylmethoxy)-pyridine | CHEMBL334860
Type:
Small organic molecule
Emp. Form.:
C10H13ClN2O
Mol. Mass.:
212.676
SMILES:
Clc1ccc(OC[C@H]2CCCN2)cn1
: