Target
B2 bradykinin receptor
Ligand
BDBM50062889
Substrate
Meas. Tech.
ChEMBL_40262 (CHEMBL653278)
IC50
810±n/a nM
Citation
 Abe, YKayakiri, HSatoh, SInoue, TSawada, YImai, KInamura, NAsano, MHatori, CKatayama, AOku, TTanaka, H A novel class of orally active non-peptide bradykinin B2 receptor antagonists. 1. Construction of the basic framework. J Med Chem 41:564-78 (1998)  
Target
Name:
B2 bradykinin receptor
Synonyms:
B2 bradykinin receptor BDKRB2 BKRB2_CAVPO | Bradykinin B2 receptor
Type:
Mol. Mass.:
42217.03
Organism:
Cavia porcellus
Description:
Residue:
372
  
Inhibitor
Name:
BDBM50062889
Synonyms:
3-Acetylamino-N-[3-(3-bromo-2-methyl-imidazo[1,2-a]pyridin-8-yloxymethyl)-2,4-dichloro-phenyl]-N-methyl-propionamide | CHEMBL356480
Type:
Small organic molecule
Emp. Form.:
C21H21BrCl2N4O3
Mol. Mass.:
528.226
SMILES:
CN(C(=O)CCNC(C)=O)c1ccc(Cl)c(COc2cccn3c(Br)c(C)nc23)c1Cl
: