Target
B2 bradykinin receptor
Ligand
BDBM50062862
Substrate
Meas. Tech.
ChEMBL_40262 (CHEMBL653278)
IC50
1700±n/a nM
Citation
 Abe, YKayakiri, HSatoh, SInoue, TSawada, YImai, KInamura, NAsano, MHatori, CKatayama, AOku, TTanaka, H A novel class of orally active non-peptide bradykinin B2 receptor antagonists. 1. Construction of the basic framework. J Med Chem 41:564-78 (1998)  
Target
Name:
B2 bradykinin receptor
Synonyms:
B2 bradykinin receptor BDKRB2 BKRB2_CAVPO | Bradykinin B2 receptor
Type:
Mol. Mass.:
42217.03
Organism:
Cavia porcellus
Description:
Residue:
372
  
Inhibitor
Name:
BDBM50062862
Synonyms:
3-Chloro-8-(2,6-dibromo-benzyloxy)-2-methyl-imidazo[1,2-a]pyridine | CHEMBL346458
Type:
Small organic molecule
Emp. Form.:
C15H11Br2ClN2O
Mol. Mass.:
430.522
SMILES:
Cc1nc2c(OCc3c(Br)cccc3Br)cccn2c1Cl
: