Target
B2 bradykinin receptor
Ligand
BDBM50062872
Substrate
Meas. Tech.
ChEMBL_40262 (CHEMBL653278)
IC50
10000±n/a nM
Citation
 Abe, YKayakiri, HSatoh, SInoue, TSawada, YImai, KInamura, NAsano, MHatori, CKatayama, AOku, TTanaka, H A novel class of orally active non-peptide bradykinin B2 receptor antagonists. 1. Construction of the basic framework. J Med Chem 41:564-78 (1998)  
Target
Name:
B2 bradykinin receptor
Synonyms:
B2 bradykinin receptor BDKRB2 BKRB2_CAVPO | Bradykinin B2 receptor
Type:
Mol. Mass.:
42217.03
Organism:
Cavia porcellus
Description:
Residue:
372
  
Inhibitor
Name:
BDBM50062872
Synonyms:
8-(2,6-Dichloro-benzyloxy)-2-ethyl-imidazo[1,2-a]pyridine | CHEMBL345670
Type:
Small organic molecule
Emp. Form.:
C16H14Cl2N2O
Mol. Mass.:
321.201
SMILES:
CCc1cn2cccc(OCc3c(Cl)cccc3Cl)c2n1
: