Target
Androgen receptor
Ligand
BDBM18537
Substrate
Meas. Tech.
ChEMBL_36279 (CHEMBL651953)
Ki
86±n/a nM
Citation
 Hamann, LGHiguchi, RIZhi, LEdwards, JPWang, XNMarschke, KBKong, JWFarmer, LJJones, TK Synthesis and biological activity of a novel series of nonsteroidal, peripherally selective androgen receptor antagonists derived from 1,2-dihydropyridono[5,6-g]quinolines. J Med Chem 41:623-39 (1998)  
Target
Name:
Androgen receptor
Synonyms:
ANDR_HUMAN Androgen Receptor Androgen receptor/Baculoviral IAP repeat-containing protein 2 Dihydrotestosterone receptor Nuclear receptor subfamily 3 group C member 4
Type:
Receptor
Mol. Mass.:
99185.27
Organism:
Homo sapiens (Human)
Description:
CHO cells were stably transfected with human AR gene.
Residue:
920
  
Inhibitor
Name:
BDBM18537
Synonyms:
8,8-dimethyl-4-(trifluoromethyl)-1H,2H,8H,9H-pyrido[3,2-g]quinolin-2-one tricyclic quinoline compound, 1
Type:
Small organic molecule
Emp. Form.:
C15H13F3N2O
Mol. Mass.:
294.2717
SMILES:
CC1(C)Nc2cc3[nH]c(=O)cc(c3cc2C=C1)C(F)(F)F
: