Target
Stromelysin-1
Ligand
BDBM8465
Substrate
Meas. Tech.
ChEMBL_104870 (CHEMBL708547)
Ki
43±n/a nM
Citation
 Pikul, SMcDow Dunham, KLAlmstead, NGDe, BNatchus, MGAnastasio, MVMcPhail, SJSnider, CETaiwo, YOChen, LDunaway, CMGu, FMieling, GE Design and synthesis of phosphinamide-based hydroxamic acids as inhibitors of matrix metalloproteinases. J Med Chem 42:87-94 (1999)  
Target
Name:
Stromelysin-1
Synonyms:
MMP-3 MMP3_HUMAN Matrix metalloproteinase 3 Matrix metalloproteinase-3 (MMP-3) SL-1 Stromelysin 1 | Transin-1
Type:
Enzyme
Mol. Mass.:
53973.13
Organism:
Homo sapiens (Human)
Description:
P08254
Residue:
477
  
Inhibitor
Name:
BDBM8465
Synonyms:
(2R)-N-hydroxy-2-[(4-methoxybenzene)(pyridin-3-ylmethyl)sulfonamido]-3-methylbutanamide CGS 27023 CHEMBL514138 | hydroxamate analogue 1
Type:
Small organic molecule
Emp. Form.:
C18H23N3O5S
Mol. Mass.:
393.457
SMILES:
COc1ccc(cc1)S(=O)(=O)N(Cc1cccnc1)[C@H](C(C)C)C(=O)NO
: