Target
Aldo-keto reductase family 1 member B1 [K65Q]
Ligand
BDBM50077322
Substrate
Meas. Tech.
ChEMBL_32265 (CHEMBL645599)
IC50
13120±n/a nM
Citation
 Costantino, LRastelli, GGamberini, MCVinson, JABose, PIannone, AStaffieri, MAntolini, LDel Corso, AMura, UAlbasini, A 1-Benzopyran-4-one antioxidants as aldose reductase inhibitors. J Med Chem 42:1881-93 (1999)  
Target
Name:
Aldo-keto reductase family 1 member B1 [K65Q]
Synonyms:
AKR1B1 Aldose reductase
Type:
Protein
Mol. Mass.:
35916.27
Organism:
Bos taurus (Cattle)
Description:
P16116[K65Q]
Residue:
315
  
Inhibitor
Name:
BDBM50077322
Synonyms:
6-Hydroxy-2-(4-hydroxy-benzyl)-chromen-4-one | CHEMBL56345
Type:
Small organic molecule
Emp. Form.:
C16H12O4
Mol. Mass.:
268.2641
SMILES:
Oc1ccc(Cc2cc(=O)c3cc(O)ccc3o2)cc1
: