Target
Neutrophil collagenase
Ligand
BDBM50077433
Substrate
Meas. Tech.
ChEMBL_105812 (CHEMBL717812)
IC50
1±n/a nM
Citation
 Matter, HSchwab, WBarbier, DBillen, GHaase, BNeises, BSchudok, MThorwart, WSchreuder, HBrachvogel, VLönze, PWeithmann, KU Quantitative structure-activity relationship of human neutrophil collagenase (MMP-8) inhibitors using comparative molecular field analysis and X-ray structure analysis. J Med Chem 42:1908-20 (1999)  
Target
Name:
Neutrophil collagenase
Synonyms:
CLG1 MMP8 Matrix metalloproteinase-8 PMNL collagenase | PMNL-CL
Type:
Enzyme
Mol. Mass.:
53413.48
Organism:
Homo sapiens (Human)
Description:
P22894
Residue:
467
  
Inhibitor
Name:
BDBM50077433
Synonyms:
(R)-7-Hydroxy-2-(4-methoxy-benzenesulfonyl)-1,2,3,4-tetrahydro-isoquinoline-3-carboxylic acid hydroxyamide | CHEMBL293359
Type:
Small organic molecule
Emp. Form.:
C17H18N2O6S
Mol. Mass.:
378.4
SMILES:
COc1ccc(cc1)S(=O)(=O)N1Cc2cc(O)ccc2C[C@@H]1C(=O)NO
: