Target
Steryl-sulfatase
Ligand
BDBM50369432
Substrate
Meas. Tech.
ChEMBL_203034 (CHEMBL812968)
IC50
1.4±n/a nM
Citation
 Ciobanu, LCBoivin, RPLuu-The, VLabrie, FPoirier, D Potent inhibition of steroid sulfatase activity by 3-O-sulfamate 17alpha-benzyl(or 4'-tert-butylbenzyl)estra-1,3,5(10)-trienes: combination of two substituents at positions C3 and c17alpha of estradiol. J Med Chem 42:2280-6 (1999)  
Target
Name:
Steryl-sulfatase
Synonyms:
ARSC1 Arylsulfatase C STS_HUMAN Steryl-sulfate sulfohydrolase
Type:
Enzyme
Mol. Mass.:
65503.66
Organism:
Homo sapiens (Human)
Description:
P08842
Residue:
583
  
Inhibitor
Name:
BDBM50369432
Synonyms:
CHEMBL1627465
Type:
Small organic molecule
Emp. Form.:
C29H39NO4S
Mol. Mass.:
497.689
SMILES:
CC(C)(C)c1ccc(C[C@]2(O)CC[C@H]3[C@@H]4CCc5cc(OS(N)(=O)=O)ccc5[C@H]4CC[C@]23C)cc1
: