Target
Ornithine transcarbamylase, mitochondrial
Ligand
BDBM50079019
Substrate
Meas. Tech.
ChEMBL_148264 (CHEMBL753864)
pH
8±n/a
Ki
1900000±n/a nM
Comments
extracted
Citation
 Flohr, AAemissegger, AHilvert, D alpha-Functionalized phosphonylphosphinates: synthesis and evaluation as transcarbamoylase inhibitors. J Med Chem 42:2633-40 (1999)  
Target
Name:
Ornithine transcarbamylase, mitochondrial
Synonyms:
OTC Ornithine carbamoyltransferase
Type:
PROTEIN
Mol. Mass.:
39943.22
Organism:
Homo sapiens (Human)
Description:
ChEMBL_148264
Residue:
354
  
Inhibitor
Name:
BDBM50079019
Synonyms:
2-Amino-5-[(hydroxy-phosphonomethyl-phosphinoylmethyl)-amino]-pentanoic acid
Type:
Small organic molecule
Emp. Form.:
C7H17N2O7P2
Mol. Mass.:
303.1672
SMILES:
[NH3+][C@@H](CCC[NH2+]CP([O-])(=O)CP(O)([O-])=O)C([O-])=O
: