Target
Ornithine transcarbamylase, mitochondrial
Ligand
BDBM50079023
Substrate
Meas. Tech.
ChEMBL_148264 (CHEMBL753864)
pH
8±n/a
Ki
200±n/a nM
Comments
extracted
Citation
 Flohr, AAemissegger, AHilvert, D alpha-Functionalized phosphonylphosphinates: synthesis and evaluation as transcarbamoylase inhibitors. J Med Chem 42:2633-40 (1999)  
Target
Name:
Ornithine transcarbamylase, mitochondrial
Synonyms:
OTC Ornithine carbamoyltransferase
Type:
PROTEIN
Mol. Mass.:
39943.22
Organism:
Homo sapiens (Human)
Description:
ChEMBL_148264
Residue:
354
  
Inhibitor
Name:
BDBM50079023
Synonyms:
2-Amino-5-(2-phosphono-acetylamino)-pentanoic acid
Type:
Small organic molecule
Emp. Form.:
C7H14N2O6P
Mol. Mass.:
253.1702
SMILES:
[NH3+][C@@H](CCCNC(=O)CP(O)([O-])=O)C([O-])=O
: