Target
Ornithine transcarbamylase, mitochondrial
Ligand
BDBM50079020
Substrate
Meas. Tech.
ChEMBL_148264 (CHEMBL753864)
pH
8±n/a
Ki
800000±n/a nM
Comments
extracted
Citation
 Flohr, AAemissegger, AHilvert, D alpha-Functionalized phosphonylphosphinates: synthesis and evaluation as transcarbamoylase inhibitors. J Med Chem 42:2633-40 (1999)  
Target
Name:
Ornithine transcarbamylase, mitochondrial
Synonyms:
OTC Ornithine carbamoyltransferase
Type:
PROTEIN
Mol. Mass.:
39943.22
Organism:
Homo sapiens (Human)
Description:
ChEMBL_148264
Residue:
354
  
Inhibitor
Name:
BDBM50079020
Synonyms:
(Aminomethyl-hydroxy-phosphinoylmethyl)-phosphonic acid
Type:
Small organic molecule
Emp. Form.:
C2H8NO5P2
Mol. Mass.:
188.0367
SMILES:
[NH3+]CP([O-])(=O)CP(O)([O-])=O
: