Target
Acetylcholinesterase
Ligand
BDBM50199522
Substrate
Meas. Tech.
ChEMBL_27821 (CHEMBL636711)
IC50
74±n/a nM
Citation
 Camps, PEl Achab, RGörbig, DMMorral, JMuñoz-Torrero, DBadia, AEladi Baños, JVivas, NMBarril, XOrozco, MLuque, FJ Synthesis, in vitro pharmacology, and molecular modeling of very potent tacrine-huperzine A hybrids as acetylcholinesterase inhibitors of potential interest for the treatment of Alzheimer's disease. J Med Chem 42:3227-42 (1999)  
Target
Name:
Acetylcholinesterase
Synonyms:
ACES_BOVIN Acetylcholinesterase (AChE) | Acetylcholinesterase precursor
Type:
Enzyme
Mol. Mass.:
67659.62
Organism:
Bos taurus (bovine)
Description:
Residue:
613
  
Inhibitor
Name:
BDBM50199522
Synonyms:
(+)-huperzine A (-)-1-Amino-13-ethylidene-11-methyl-6-aza-tricyclo[7.3.1.0*2,7*]trideca-2(7),3,10-trien-5-one(Huperzine A) (-)-huperzine A (1R,9R)-1-Amino-13-eth-(E)-ylidene-11-methyl-6-aza-tricyclo[7.3.1.0*2,7*]trideca-2(7),3,10-trien-5-one (R)-1-Amino-13-ethylidene-11-methyl-6-aza-tricyclo[7.3.1.0*2,7*]trideca-2(7),3,10-trien-5-one 1-Amino-13-eth-(E)-ylidene-11-methyl-6-aza-tricyclo[7.3.1.0*2,7*]trideca-2(7),3,10-trien-5-one 1-Amino-13-ethylidene-11-methyl-6-aza-tricyclo[7.3.1.0*2,7*]trideca-2(7),3,10-trien-5-one 1-Amino-13-ethylidene-11-methyl-6-aza-tricyclo[7.3.1.0*2,7*]trideca-2(7),3,10-trien-5-one((-)-Huperzine A) CHEMBL395280 Hyperazzine A
Type:
Small organic molecule
Emp. Form.:
C15H18N2O
Mol. Mass.:
242.3162
SMILES:
C\C=C1/[C@@H]2Cc3[nH]c(=O)ccc3[C@@]1(N)CC(C)=C2
: