Target
Protein farnesyltransferase subunit beta/geranylgeranyltransferase type-1 subunit alpha
Ligand
BDBM50079978
Substrate
Meas. Tech.
ChEMBL_70716 (CHEMBL682420)
IC50
0.41±n/a nM
Citation
 Anthony, NJGomez, RPSchaber, MDMosser, SDHamilton, KAO'Neil, TJKoblan, KSGraham, SLHartman, GDShah, DRands, EKohl, NEGibbs, JBOliff, AI Design and in vivo analysis of potent non-thiol inhibitors of farnesyl protein transferase. J Med Chem 42:3356-68 (1999)  
Target
Name:
Protein farnesyltransferase subunit beta/geranylgeranyltransferase type-1 subunit alpha
Synonyms:
Farnesyltransferase (FTase) Protein Farnesyltransferase (PFT) Chain B | Protein farnesyltransferase
Type:
Protein Complex
Mol. Mass.:
Description:
To express recombinant enzyme in E. coli, the cloned human alpha and beta subunits were co-expressed from a plasmid, in which their expression was translationally coupled.
Components:
This complex has 2 components.
Component 1
Name:
Protein farnesyltransferase subunit beta
Synonyms:
CAAX farnesyltransferase subunit alpha FNTB FTase-alpha GGTase-I-alpha Protein farnesyl/geranylgeranyl transferase Protein farnesyltransferase subunit beta Protein farnesyltransferase/geranylgeranyltransferase type-1 subunit alpha Ras proteins prenyltransferase subunit beta | Type I protein geranyl-geranyltransferase subunit alpha
Type:
Enzyme Subunit
Mol. Mass.:
48766.02
Organism:
Homo sapiens (Human)
Description:
Protein farnesyltransferase subunit beta
Residue:
437
  
Component 2
Name:
Protein farnesyltransferase/geranylgeranyltransferase type-1 subunit alpha
Synonyms:
CAAX farnesyltransferase alpha subunit FNTA_HUMAN FTase-alpha Geranylgeranyl Transferase (GGTase-I) Chain A Protein Farnesyltransferase (PFT) Chain A Protein farnesyltransferase Protein farnesyltransferase/geranylgeranyltransferase type I alpha subunit | Ras proteins prenyltransferase alpha
Type:
Enzyme
Mol. Mass.:
44392.46
Organism:
Homo sapiens (Human)
Description:
Recombinant human FTase.
Residue:
379
  
Inhibitor
Name:
BDBM50079978
Synonyms:
(S)-2-{2-[((S)-2-{2-[3-((E)-3,7-Dimethyl-octa-2,6-dienyl)-3H-imidazol-4-yl]-acetylamino}-3-methyl-pentyl)-naphthalen-1-ylmethyl-amino]-acetylamino}-4-methylsulfanyl-butyric acid | CHEMBL115502
Type:
Small organic molecule
Emp. Form.:
C39H55N5O4S
Mol. Mass.:
689.95
SMILES:
[#6]-[#6]-[#6](-[#6])-[#6@@H](-[#6]-[#7](-[#6]-[#6](=O)-[#7]-[#6@@H](-[#6]-[#6]-[#16]-[#6])-[#6](-[#8])=O)-[#6]-c1cccc2ccccc12)-[#7]-[#6](=O)-[#6]-c1cncn1-[#6]\[#6]=[#6](/[#6])-[#6]-[#6]\[#6]=[#6](\[#6])-[#6]
: