Target
Bifunctional purine biosynthesis protein ATIC
Ligand
BDBM50369444
Substrate
Meas. Tech.
ChEMBL_28429 (CHEMBL642471)
Kd
20±n/a nM
Citation
 Wall, MShim, JHBenkovic, SJ A multisubstrate adduct inhibitor of AICAR transformylase. J Med Chem 42:3421-4 (1999)  
Target
Name:
Bifunctional purine biosynthesis protein ATIC
Synonyms:
5-aminoimidazole-4-carboxamide ribonucleotide formyltransferase AICAR Tfase ATIC Bifunctional purine biosynthesis protein PURH IMP cyclohydrolase Inosinicase PURH Thymidylate synthase/GAR transformylase/AICAR transformylase
Type:
Protein
Mol. Mass.:
64616.62
Organism:
Homo sapiens (Human)
Description:
P31939
Residue:
592
  
Inhibitor
Name:
BDBM50369444
Synonyms:
CHEMBL608337
Type:
Small organic molecule
Emp. Form.:
C32H36N9O15P
Mol. Mass.:
817.6533
SMILES:
NC(=O)c1ncn(C2O[C@H](COP(O)(O)=O)[C@@H](O)[C@H]2O)c1C=CC(=O)N(CC1=Nc2c(CC1)nc(N)[nH]c2=O)c1ccc(cc1)C(=O)N[C@@H](CCC(O)=O)C(O)=O
: