Target
Sodium- and chloride-dependent GABA transporter 1
Ligand
BDBM50080358
Substrate
Meas. Tech.
ChEMBL_202725 (CHEMBL807623)
Ki
12±n/a nM
Citation
 Knutsen, LJAndersen, KELau, JLundt, BFHenry, RFMorton, HENaerum, LPetersen, HStephensen, HSuzdak, PDSwedberg, MDThomsen, CSørensen, PO Synthesis of novel GABA uptake inhibitors. 3. Diaryloxime and diarylvinyl ether derivatives of nipecotic acid and guvacine as anticonvulsant agents. J Med Chem 42:3447-62 (1999)  
Target
Name:
Sodium- and chloride-dependent GABA transporter 1
Synonyms:
GABA transporter Gat-1 SC6A1_RAT Solute carrier family 6 member 1
Type:
PROTEIN
Mol. Mass.:
67006.26
Organism:
Rattus norvegicus
Description:
ChEMBL_1472611
Residue:
599
  
Inhibitor
Name:
BDBM50080358
Synonyms:
1-{2-[2,2-Bis-(2-chloro-phenyl)-vinyloxy]-ethyl}-1,2,5,6-tetrahydro-pyridine-3-carboxylic acid; hydrochloride | CHEMBL545516
Type:
Small organic molecule
Emp. Form.:
C22H21Cl2NO3
Mol. Mass.:
418.313
SMILES:
[#8]-[#6](=O)-[#6]-1=[#6]-[#6]-[#6]-[#7](-[#6]-[#6]-[#8]\[#6]=[#6](\c2ccccc2Cl)-c2ccccc2Cl)-[#6]-1
: