Target
Carbonic anhydrase 2
Ligand
BDBM50080687
Substrate
Meas. Tech.
ChEMBL_45082 (CHEMBL657153)
Ki
9±n/a nM
Citation
 Scozzafava, ABriganti, FMincione, GMenabuoni, LMincione, FSupuran, CT Carbonic anhydrase inhibitors: synthesis of water-soluble, aminoacyl/dipeptidyl sulfonamides possessing long-lasting intraocular pressure-lowering properties via the topical route. J Med Chem 42:3690-700 (1999)  
Target
Name:
Carbonic anhydrase 2
Synonyms:
CA-II CAC Carbonate dehydratase II Carbonic anhydrase 2 (CA-II) Carbonic anhydrase C Carbonic anhydrase II (CA-II) Carbonic anhydrase II (hCA II) | Carbonic anhydrase isoenzyme II (hCA II)
Type:
Enzyme
Mol. Mass.:
29250.71
Organism:
Homo sapiens (Human)
Description:
P00918
Residue:
260
  
Inhibitor
Name:
BDBM50080687
Synonyms:
2-Amino-N-(2-sulfamoyl-benzothiazol-6-yl)-acetamide | CHEMBL340569
Type:
Small organic molecule
Emp. Form.:
C9H10N4O3S2
Mol. Mass.:
286.331
SMILES:
NCC(=O)Nc1ccc2nc(sc2c1)S(N)(=O)=O
: