Target
Carbonic anhydrase 4
Ligand
BDBM50080660
Substrate
Meas. Tech.
ChEMBL_45427 (CHEMBL657028)
Ki
62±n/a nM
Citation
 Scozzafava, ABriganti, FMincione, GMenabuoni, LMincione, FSupuran, CT Carbonic anhydrase inhibitors: synthesis of water-soluble, aminoacyl/dipeptidyl sulfonamides possessing long-lasting intraocular pressure-lowering properties via the topical route. J Med Chem 42:3690-700 (1999)  
Target
Name:
Carbonic anhydrase 4
Synonyms:
CA-IV CAH4_BOVIN Carbonic Anhydrase IV Carbonic anhydrase 4
Type:
Enzyme
Mol. Mass.:
35152.74
Organism:
Bos taurus (bovine)
Description:
Bovine isozyme, isolated from lung microsomes
Residue:
312
  
Inhibitor
Name:
BDBM50080660
Synonyms:
CHEMBL125776 | N-(2-Chloro-4-sulfamoyl-phenyl)-2-methylamino-acetamide
Type:
Small organic molecule
Emp. Form.:
C9H12ClN3O3S
Mol. Mass.:
277.728
SMILES:
CNCC(=O)Nc1ccc(cc1Cl)S(N)(=O)=O
: