Target
Carbonic anhydrase 4
Ligand
BDBM50080658
Substrate
Meas. Tech.
ChEMBL_45427 (CHEMBL657028)
Ki
5±n/a nM
Citation
 Scozzafava, ABriganti, FMincione, GMenabuoni, LMincione, FSupuran, CT Carbonic anhydrase inhibitors: synthesis of water-soluble, aminoacyl/dipeptidyl sulfonamides possessing long-lasting intraocular pressure-lowering properties via the topical route. J Med Chem 42:3690-700 (1999)  
Target
Name:
Carbonic anhydrase 4
Synonyms:
CA-IV CAH4_BOVIN Carbonic Anhydrase IV Carbonic anhydrase 4
Type:
Enzyme
Mol. Mass.:
35152.74
Organism:
Bos taurus (bovine)
Description:
Bovine isozyme, isolated from lung microsomes
Residue:
312
  
Inhibitor
Name:
BDBM50080658
Synonyms:
2-(N-Methyl-guanidino)-N-[4-(5-sulfamoyl-[1,3,4]thiadiazol-2-ylsulfamoyl)-phenyl]-acetamide | CHEMBL419604
Type:
Small organic molecule
Emp. Form.:
C12H16N8O5S3
Mol. Mass.:
448.501
SMILES:
CN(CC(=O)Nc1ccc(cc1)S(=O)(=O)Nc1nnc(s1)S(N)(=O)=O)C(N)=N
: