Target
Carbonic anhydrase 2
Ligand
BDBM50080738
Substrate
Meas. Tech.
ChEMBL_45082 (CHEMBL657153)
Ki
14±n/a nM
Citation
 Scozzafava, ABriganti, FMincione, GMenabuoni, LMincione, FSupuran, CT Carbonic anhydrase inhibitors: synthesis of water-soluble, aminoacyl/dipeptidyl sulfonamides possessing long-lasting intraocular pressure-lowering properties via the topical route. J Med Chem 42:3690-700 (1999)  
Target
Name:
Carbonic anhydrase 2
Synonyms:
CA-II CAC Carbonate dehydratase II Carbonic anhydrase 2 (CA-II) Carbonic anhydrase C Carbonic anhydrase II (CA-II) Carbonic anhydrase II (hCA II) | Carbonic anhydrase isoenzyme II (hCA II)
Type:
Enzyme
Mol. Mass.:
29250.71
Organism:
Homo sapiens (Human)
Description:
P00918
Residue:
260
  
Inhibitor
Name:
BDBM50080738
Synonyms:
CHEMBL121662 | N-(2,3-Dichloro-4,6-disulfamoyl-phenyl)-2-methylamino-acetamide
Type:
Small organic molecule
Emp. Form.:
C9H12Cl2N4O5S2
Mol. Mass.:
391.251
SMILES:
CNCC(=O)Nc1c(Cl)c(Cl)c(cc1S(N)(=O)=O)S(N)(=O)=O
: