Target
Tumor necrosis factor
Ligand
BDBM50081321
Substrate
Meas. Tech.
ChEMBL_212403 (CHEMBL816155)
IC50
>25000±n/a nM
Citation
 Chao, QDeng, LShih, HLeoni, LMGenini, DCarson, DACottam, HB Substituted isoquinolines and quinazolines as potential antiinflammatory agents. Synthesis and biological evaluation of inhibitors of tumor necrosis factor alpha. J Med Chem 42:3860-73 (1999)  
Target
Name:
Tumor necrosis factor
Synonyms:
Cachectin TNF-a TNFA TNFSF2 Tumor necrosis factor (TNFa) Tumor necrosis factor ligand superfamily member 2 Tumor necrosis factor, soluble form | tumor necrosis factor alpha
Type:
Enzyme
Mol. Mass.:
25645.11
Organism:
Homo sapiens (Human)
Description:
P01375
Residue:
233
  
Inhibitor
Name:
BDBM50081321
Synonyms:
4-(6-Chloro-4-oxo-4H-quinazolin-3-yl)-butyric acid ethyl ester | CHEMBL339952
Type:
Small organic molecule
Emp. Form.:
C14H15ClN2O3
Mol. Mass.:
294.734
SMILES:
CCOC(=O)CCCn1cnc2ccc(Cl)cc2c1=O
: